Home > Unable To > Unable To Validate Regist/error In Downloading Exp 7

Unable To Validate Regist/error In Downloading Exp 7

Contents

Analysis: let's fix your wget https://registry.npmjs.org/coffee-script problem first. Installation errors Error Scenario Error Type Error Code Error Message Setup.exe doesn't exist or the sign check fails Fatal REG_SETVALUE_FAILURE This installation is no longer functional. What was the problem with this article? The mounting process timed out after 60 seconds. http://wpquickadminthemes.com/unable-to/unable-to-use-malwarebytes-w-error-codes.html

of China India - English New Zealand Southeast Asia (Includes Indonesia, Malaysia, Philippines, Singapore, Thailand, and Vietnam) - English 中国 中國香港特別行政區 台灣 日本 한국 Commonwealth of Independent States Includes Armenia, Azerbaijan, If the XML file is not obtained from the network, an attempt is made to locate an existing version of this file on the local machine.Error Code 799:Itanium class servers are See the following document for more information:Patch Scanning Error 1300 - Not All Privileges Or Groups Referenced Are Assigned To The CallerAffected Product(s)Shavlik Protect, All Versions 25841Views Categories: Tags: none (add) at ClientRequest.g (events.js:193:14) npm ERR! https://support.microsoft.com/en-us/kb/2715304

Adobe Chat

Unable to reach Adobe servers. Click Retry to download and install it again. Have your serial number or Adobe ID ready. 93:-9 93:-10 An internal server component is unavailable. E.g.

at ClientRequest.EventEmitter.emit (events.js:123:20) npm ERR! After some digging I realized that many post/pre-install scripts would try to install various dependencies and some times specific repositories are used. at ClientRequest.onConnect (c:\Program Files\nodejs\node_modules\npm\node_modules\request\tunnel.js:148:19) npm ERR! Adobe Photoshop Issue 5: Error in communicating with the vShield manager You are unable to activate your DSVA because of an error in communicating with the vShield manager.

Here are solutions to some common deactivation problems. AMD refers to their version of DEP as the NX-bit or No Execute bit. I. https://community.shavlik.com/docs/DOC-2159 Have your serial number or Adobe ID ready. 194:112 Client clock out of sync Your computer clock time is incorrect.

Last error: 0. Adobe Reader You signed out in another tab or window. C:\> nslookup dsm.test.comServer: dc.test.comAddress: 10.10.1.1 Name: dsm.test.comAddress: 10.10.1.50 Check and make sure that the system time for DSA and DSM are synchronized.Check the DSA and make sure that it is not If you encountered an error when activating the DSA locally, enable additional logging to determine the cause of the activation error.

Adobe Support

Try powering on this image to ensure that it is still valid. read this article This may occur when scanning beta or unreleased versions of Microsoft Service Packs.Error Code 701:File http://download.microsoft.com/download/ ... Adobe Chat Select another install language in your preferences and then try again. Adobe Login Alternatively, you may open the certificate file, ds_agent_dsm.crt, and go to the Details tab to verify the manager where the agent is activated from. If the DSM where it is

Issue 4: Possible corrupted database files on the Deep Security Agent To resolve the issue: Reset the current DSA configuration by running this command under the ..\Program Files\Trend Micro\Deep Security Agent http://wpquickadminthemes.com/unable-to/unable-to-uninstall-java-7-0-70-and-update-to-7-15-browser-launch-1314-error.html Loading Skip to content Ignore Learn more Please note that GitHub no longer supports old versions of Firefox. Have your serial number or Adobe ID ready. Asia Pacific Europe Latin America Mediterranean, Middle East & Africa North America Europe France Germany Italy Spain Rest of Europe This website uses cookies to save your regional preference. Adobe Creative Cloud Download

Edit: It's a really common suggestion to turn off HTTPS for this problem either by using an HTTP registry or setting NODE_TLS_REJECT_UNAUTHORIZED. registry error parsing json npm ERR! Asia Pacific Europe Latin America Mediterranean, Middle East & Africa North America Europe France Germany Italy Spain United Kingdom Rest of Europe This website uses cookies to save your regional preference. navigate here cb() never called!

A better way is to disable certificate check for https module for nodejs that worked for me. Last modified by cwinning on Aug 30, 2016 2:16 PM. Esri cannot guarantee results from incorrect modifications while following these instructions; therefore, use caution and proceed at your own risk.

Access permission error during download (User/system error) Retryable _WRITE_PERMISSION= 121 Error writing to the temporary file location.

Search on GeoNet Submit to ArcGIS Ideas Back to Top Error: Error 1904: failed to register C:\Program Files\ArcGIS\Bin\xmlsupportui.dll, 3dsymbolsui.dll, or GxRaster.dll Error Message Installing ArcGIS products on a machine with a Select another install location in your preferences and then try again. not working because they use HTTPS_PROXY (except when they use HTTP_PROXY - see later). at Socket.socketOnData (http.js:1393:11) npm ERR!

Download the intermediate code signing certificate: https://knowledge.symantec.com/library/VERISIGN/ALL_OTHER/Certificates/Code2010/VeriSign_Class_3_Code_Signing_2010_CA.cer Using an internal network connection, or physical media such as a thumb drive, bring these files to the computer on which you need to connected. npm i boom --registry http://registry.npmjs.eu/ asmithaxe commented Sep 13, 2015 👍 koresar commented Sep 14, 2015 Sometimes npm install results with npm ERR! http://wpquickadminthemes.com/unable-to/unable-to-open-run-flashdrives-error-solution-vbs.html Error: tunneling socket could not be established, sutatusCode=403 npm ERR!

Ask now Contact Us Real help from real people. Click Retry to download and install itagain. See Advanced connectivity troubleshooting to check your firewall or proxy settings and try again. 213:5 213:10 These errors are due to a read-only SLStore folder. C:\> nslookup Win7-32.seg.localServer: seg-dc.seg.localAddress: 10.10.1.1 Name: Win7-32.seg.localAddress: 10.10.1.200 Check if DSA is able to resolve the hostname or FQDN used by the server.

No Yes Skip navigation Sitemap Downloads Content Documentation Support Portal Site Help HomeTrainingDocumentsDiscussionsBrowseAdvice CenterAll ContentBookmarksDiscussionsDocumentsNewsPeoplePlacesLog inRegister0SearchSearchCancelError: You don't have JavaScript enabled. Can you lose child access in Germany because you made "xenophobic" comments? Uninstall it and download Creative Cloud again. Generic PIM error Fatal HDPIM_STATUS_ERROR =101 Unable to install the product. Ensure that Local computer is selected, and then click Finish.

See Creative Cloud activation and sign-in troubleshooting.

Are your computer's date and time correct? Set your computer clock to the correct date and time. 208:1 208:2 208:3 Error_NetworkFailure An Internet connection is not detected.